BDBM19189 7-(3-Chlorobenzyloxy)-4-carboxaldehyde-coumarin, 3::7-[(3-chlorophenyl)methoxy]-2-oxo-2H-chromene-4-carbaldehyde::C17
SMILES Clc1cccc(COc2ccc3c(C=O)cc(=O)oc3c2)c1
InChI Key InChIKey=ZOCADHRNWNJARU-UHFFFAOYSA-N
Data  2 KI  2 IC50
PDB links: 1 PDB ID matches this monomer.
  Tab Delimited (TSV)   2D SDfile   Computed 3D by Vconf -m prep SDfile
Find this compound or compounds like it in BindingDB:
Activity Spreadsheet -- Enzyme Inhibition Constant Data from BindingDB
Found 1 hit for monomerid = 19189
TargetAmine oxidase [flavin-containing] A(Homo sapiens (Human))
University of Pavia
LigandPNGBDBM19189(7-(3-Chlorobenzyloxy)-4-carboxaldehyde-coumarin, 3...)
Affinity DataKi:  1.10E+4nM ΔG°:  -6.76kcal/molepH: 7.5 T: 2°C. Assay description: MAO A activities were determined spectrophotometrically at 316 nm using kynuramine as substrate. Competitive Ki values were determined by measuring i...
In DepthDetails ArticlePubMed